{"text_format":"3","workbook":"xlsx","n_sheets":3,"sheets":["PROJECT PARAMETERS","PROJECT DETAILS","PROJECT TOTALS"],"not_rendered":{"charts":2,"defined_names":3,"pivot_tables":1},"read":"whole","date_system":"1900"}

{"sheet":"PROJECT PARAMETERS","index":0,"n_rows":21,"n_cols":9,"rows_kept":21}
[]
[null,"[Company Name]"]
[null,"Event Management Project Tracker"]
[null,"Company Confidential"]
[]
[null,"Shaded cells are calculated for you. You do not need to enter anything into them."]
[null,"PROJECT TYPE","ACCOUNT MANAGER","PROJECT MANAGER","STRATEGY MANAGER","DESIGN SPECIALIST","EVENT STAFF","ADMIN STAFF","Total"]
[null,"Event strategy development",{"v":0.2,"d":"20%"},{"v":0.1,"d":"10%"},{"v":0.6,"d":"60%"},{"v":0,"d":"0%"},{"v":0,"d":"0%"},{"v":0.1,"d":"10%"},{"$f":"SUM(tblParameters[[#This Row],[ACCOUNT MANAGER]:[ADMIN STAFF]])","v":{"v":1,"d":"100%"}}]
[null,"Event planning",{"v":0.2,"d":"20%"},{"v":0.5,"d":"50%"},{"v":0.1,"d":"10%"},{"v":0.1,"d":"10%"},{"v":0,"d":"0%"},{"v":0.1,"d":"10%"},{"$f":"SUM(tblParameters[[#This Row],[ACCOUNT MANAGER]:[ADMIN STAFF]])","v":{"v":0.9999999999999999,"d":"100%"}}]
[null,"Event design",{"v":0.2,"d":"20%"},{"v":0.2,"d":"20%"},{"v":0,"d":"0%"},{"v":0.5,"d":"50%"},{"v":0,"d":"0%"},{"v":0.1,"d":"10%"},{"$f":"SUM(tblParameters[[#This Row],[ACCOUNT MANAGER]:[ADMIN STAFF]])","v":{"v":1,"d":"100%"}}]
{"$rows_left_out":12}
{"sheet":"PROJECT DETAILS","index":1,"n_rows":29,"n_cols":23,"rows_kept":29,"merged":[[4,11,4,16],[4,17,4,22]]}
[]
[null,{"$f":"'PROJECT PARAMETERS'!B2","v":"[Company Name]"}]
[null,"Event Management Project Tracker"]
[null,"Company Confidential"]
[{"$nulls":11},"PLANNING",{"$nulls":5},"ACTUALS"]
[null,"PROJECT NAME","PROJECT TYPE","ESTIMATED START","ESTIMATED FINISH","ACTUAL START","ACTUAL FINISH","ESTIMATED WORK","ACTUAL WORK","ESTIMATED DURATION","ACTUAL DURATION","ACCOUNT MANAGER","PROJECT MANAGER","STRATEGY MANAGER","DESIGN SPECIALIST","EVENT STAFF","ADMIN STAFF","ACCOUNT MANAGER ","PROJECT MANAGER ","STRATEGY MANAGER ","DESIGN SPECIALIST ","EVENT STAFF ","ADMIN STAFF "]
[null,"A. Datum Corporation","Event strategy development","2013-06-09","2013-08-07","2013-06-29","2013-09-03",200,220,{"$f":"DAYS360(tblDetails[[#This Row],[ESTIMATED START]],tblDetails[[#This Row],[ESTIMATED FINISH]],FALSE)","v":58},{"$f":"DAYS360(tblDetails[[#This Row],[ACTUAL START]],tblDetails[[#This Row],[ACTUAL FINISH]],FALSE)","v":64},{"$f":"INDEX(tblParameters[],MATCH(tblDetails[[#This Row],[PROJECT TYPE]],tblParameters[PROJECT TYPE],0),MATCH(tblDetails[[#Headers],[ACCOUNT MANAGER]],tblParameters[#Headers],0))*INDEX('PROJECT PARAMETERS'!$B$14:$H$14,1,MATCH(tblDetails[[#Headers],[ACCOUNT MANAGER]],tblParameters[#Headers],0))*tblDetails[[#This Row],[ESTIMATED WORK]]","v":{"v":7200,"d":"$7,200"}},{"$f":"INDEX(tblParameters[],MATCH(tblDetails[[#This Row],[PROJECT TYPE]],tblParameters[PROJECT TYPE],0),MATCH(tblDetails[[#Headers],[PROJECT MANAGER]],tblParameters[#Headers],0))*INDEX('PROJECT PARAMETERS'!$B$14:$H$14,1,MATCH(tblDetails[[#Headers],[PROJECT MANAGER]],tblParameters[#Headers],0))*tblDetails[[#This Row],[ESTIMATED WORK]]","v":{"v":2400,"d":"$2,400"}},{"$f":"INDEX(tblParameters[],MATCH(tblDetails[[#This Row],[PROJECT TYPE]],tblParameters[PROJECT TYPE],0),MATCH(tblDetails[[#Headers],[STRATEGY MANAGER]],tblParameters[#Headers],0))*INDEX('PROJECT PARAMETERS'!$B$14:$H$14,1,MATCH(tblDetails[[#Headers],[STRATEGY MANAGER]],tblParameters[#Headers],0))*tblDetails[[#This Row],[ESTIMATED WORK]]","v":{"v":18000,"d":"$18,000"}},{"$f":"INDEX(tblParameters[],MATCH(tblDetails[[#This Row],[PROJECT TYPE]],tblParameters[PROJECT TYPE],0),MATCH(tblDetails[[#Headers],[DESIGN SPECIALIST]],tblParameters[#Headers],0))*INDEX('PROJECT PARAMETERS'!$B$14:$H$14,1,MATCH(tblDetails[[#Headers],[DESIGN SPECIALIST]],tblParameters[#Headers],0))*tblDetails[[#This Row],[ESTIMATED WORK]]","v":{"v":0,"d":"$0"}},{"$f":"INDEX(tblParameters[],MATCH(tblDetails[[#This Row],[PROJECT TYPE]],tblParameters[PROJECT TYPE],0),MATCH(tblDetails[[#Headers],[EVENT STAFF]],tblParameters[#Headers],0))*INDEX('PROJECT PARAMETERS'!$B$14:$H$14,1,MATCH(tblDetails[[#Headers],[EVENT STAFF]],tblParameters[#Headers],0))*tblDetails[[#This Row],[ESTIMATED WORK]]","v":{"v":0,"d":"$0"}},{"$f":"INDEX(tblParameters[],MATCH(tblDetails[[#This Row],[PROJECT TYPE]],tblParameters[PROJECT TYPE],0),MATCH(tblDetails[[#Headers],[ADMIN STAFF]],tblParameters[#Headers],0))*INDEX('PROJECT PARAMETERS'!$B$14:$H$14,1,MATCH(tblDetails[[#Headers],[ADMIN STAFF]],tblParameters[#Headers],0))*tblDetails[[#This Row],[ESTIMATED WORK]]","v":{"v":1200,"d":"$1,200"}},{"$f":"INDEX(tblParameters[],MATCH(tblDetails[[#This Row],[PROJECT TYPE]],tblParameters[PROJECT TYPE],0),MATCH(tblDetails[[#Headers],[ACCOUNT MANAGER]],tblParameters[#Headers],0))*INDEX('PROJECT PARAMETERS'!$B$14:$H$14,1,MATCH(tblDetails[[#Headers],[ACCOUNT MANAGER]],tblParameters[#Headers],0))*tblDetails[[#This Row],[ACTUAL WORK]]","v":{"v":7920,"d":"$7,920"}},{"$f":"INDEX(tblParameters[],MATCH(tblDetails[[#This Row],[PROJECT TYPE]],tblParameters[PROJECT TYPE],0),MATCH(tblDetails[[#Headers],[PROJECT MANAGER]],tblParameters[#Headers],0))*INDEX('PROJECT PARAMETERS'!$B$14:$H$14,1,MATCH(tblDetails[[#Headers],[PROJECT MANAGER]],tblParameters[#Headers],0))*tblDetails[[#This Row],[ACTUAL WORK]]","v":{"v":2640,"d":"$2,640"}},{"$f":"INDEX(tblParameters[],MATCH(tblDetails[[#This Row],[PROJECT TYPE]],tblParameters[PROJECT TYPE],0),MATCH(tblDetails[[#Headers],[STRATEGY MANAGER]],tblParameters[#Headers],0))*INDEX('PROJECT PARAMETERS'!$B$14:$H$14,1,MATCH(tblDetails[[#Headers],[STRATEGY MANAGER]],tblParameters[#Headers],0))*tblDetails[[#This Row],[ACTUAL WORK]]","v":{"v":19800,"d":"$19,800"}},{"$f":"INDEX(tblParameters[],MATCH(tblDetails[[#This Row],[PROJECT TYPE]],tblParameters[PROJECT TYPE],0),MATCH(tblDetails[[#Headers],[DESIGN SPECIALIST]],tblParameters[#Headers],0))*INDEX('PROJECT PARAMETERS'!$B$14:$H$14,1,MATCH(tblDetails[[#Headers],[DESIGN SPECIALIST]],tblParameters[#Headers],0))*tblDetails[[#This Row],[ACTUAL WORK]]","v":{"v":0,"d":"$0"}},{"$f":"INDEX(tblParameters[],MATCH(tblDetails[[#This Row],[PROJECT TYPE]],tblParameters[PROJECT TYPE],0),MATCH(tblDetails[[#Headers],[EVENT STAFF]],tblParameters[#Headers],0))*INDEX('PROJECT PARAMETERS'!$B$14:$H$14,1,MATCH(tblDetails[[#Headers],[EVENT STAFF]],tblParameters[#Headers],0))*tblDetails[[#This Row],[ACTUAL WORK]]","v":{"v":0,"d":"$0"}},{"$f":"INDEX(tblParameters[],MATCH(tblDetails[[#This Row],[PROJECT TYPE]],tblParameters[PROJECT TYPE],0),MATCH(tblDetails[[#Headers],[ADMIN STAFF]],tblParameters[#Headers],0))*INDEX('PROJECT PARAMETERS'!$B$14:$H$14,1,MATCH(tblDetails[[#Headers],[ADMIN STAFF]],tblParameters[#Headers],0))*tblDetails[[#This Row],[ACTUAL WORK]]","v":{"v":1320,"d":"$1,320"}}]
[null,"Adventure Works","Event planning","2013-06-25","2013-07-27","2013-07-15","2013-08-25",400,390,{"$f":"DAYS360(tblDetails[[#This Row],[ESTIMATED START]],tblDetails[[#This Row],[ESTIMATED FINISH]],FALSE)","v":32},{"$f":"DAYS360(tblDetails[[#This Row],[ACTUAL START]],tblDetails[[#This Row],[ACTUAL FINISH]],FALSE)","v":40},{"$f":"INDEX(tblParameters[],MATCH(tblDetails[[#This Row],[PROJECT TYPE]],tblParameters[PROJECT TYPE],0),MATCH(tblDetails[[#Headers],[ACCOUNT MANAGER]],tblParameters[#Headers],0))*INDEX('PROJECT PARAMETERS'!$B$14:$H$14,1,MATCH(tblDetails[[#Headers],[ACCOUNT MANAGER]],tblParameters[#Headers],0))*tblDetails[[#This Row],[ESTIMATED WORK]]","v":{"v":14400,"d":"$14,400"}},{"$f":"INDEX(tblParameters[],MATCH(tblDetails[[#This Row],[PROJECT TYPE]],tblParameters[PROJECT TYPE],0),MATCH(tblDetails[[#Headers],[PROJECT MANAGER]],tblParameters[#Headers],0))*INDEX('PROJECT PARAMETERS'!$B$14:$H$14,1,MATCH(tblDetails[[#Headers],[PROJECT MANAGER]],tblParameters[#Headers],0))*tblDetails[[#This Row],[ESTIMATED WORK]]","v":{"v":24000,"d":"$24,000"}},{"$f":"INDEX(tblParameters[],MATCH(tblDetails[[#This Row],[PROJECT TYPE]],tblParameters[PROJECT TYPE],0),MATCH(tblDetails[[#Headers],[STRATEGY MANAGER]],tblParameters[#Headers],0))*INDEX('PROJECT PARAMETERS'!$B$14:$H$14,1,MATCH(tblDetails[[#Headers],[STRATEGY MANAGER]],tblParameters[#Headers],0))*tblDetails[[#This Row],[ESTIMATED WORK]]","v":{"v":6000,"d":"$6,000"}},{"$f":"INDEX(tblParameters[],MATCH(tblDetails[[#This Row],[PROJECT TYPE]],tblParameters[PROJECT TYPE],0),MATCH(tblDetails[[#Headers],[DESIGN SPECIALIST]],tblParameters[#Headers],0))*INDEX('PROJECT PARAMETERS'!$B$14:$H$14,1,MATCH(tblDetails[[#Headers],[DESIGN SPECIALIST]],tblParameters[#Headers],0))*tblDetails[[#This Row],[ESTIMATED WORK]]","v":{"v":4000,"d":"$4,000"}},{"$f":"INDEX(tblParameters[],MATCH(tblDetails[[#This Row],[PROJECT TYPE]],tblParameters[PROJECT TYPE],0),MATCH(tblDetails[[#Headers],[EVENT STAFF]],tblParameters[#Headers],0))*INDEX('PROJECT PARAMETERS'!$B$14:$H$14,1,MATCH(tblDetails[[#Headers],[EVENT STAFF]],tblParameters[#Headers],0))*tblDetails[[#This Row],[ESTIMATED WORK]]","v":{"v":0,"d":"$0"}},{"$f":"INDEX(tblParameters[],MATCH(tblDetails[[#This Row],[PROJECT TYPE]],tblParameters[PROJECT TYPE],0),MATCH(tblDetails[[#Headers],[ADMIN STAFF]],tblParameters[#Headers],0))*INDEX('PROJECT PARAMETERS'!$B$14:$H$14,1,MATCH(tblDetails[[#Headers],[ADMIN STAFF]],tblParameters[#Headers],0))*tblDetails[[#This Row],[ESTIMATED WORK]]","v":{"v":2400,"d":"$2,400"}},{"$f":"INDEX(tblParameters[],MATCH(tblDetails[[#This Row],[PROJECT TYPE]],tblParameters[PROJECT TYPE],0),MATCH(tblDetails[[#Headers],[ACCOUNT MANAGER]],tblParameters[#Headers],0))*INDEX('PROJECT PARAMETERS'!$B$14:$H$14,1,MATCH(tblDetails[[#Headers],[ACCOUNT MANAGER]],tblParameters[#Headers],0))*tblDetails[[#This Row],[ACTUAL WORK]]","v":{"v":14040,"d":"$14,040"}},{"$f":"INDEX(tblParameters[],MATCH(tblDetails[[#This Row],[PROJECT TYPE]],tblParameters[PROJECT TYPE],0),MATCH(tblDetails[[#Headers],[PROJECT MANAGER]],tblParameters[#Headers],0))*INDEX('PROJECT PARAMETERS'!$B$14:$H$14,1,MATCH(tblDetails[[#Headers],[PROJECT MANAGER]],tblParameters[#Headers],0))*tblDetails[[#This Row],[ACTUAL WORK]]","v":{"v":23400,"d":"$23,400"}},{"$f":"INDEX(tblParameters[],MATCH(tblDetails[[#This Row],[PROJECT TYPE]],tblParameters[PROJECT TYPE],0),MATCH(tblDetails[[#Headers],[STRATEGY MANAGER]],tblParameters[#Headers],0))*INDEX('PROJECT PARAMETERS'!$B$14:$H$14,1,MATCH(tblDetails[[#Headers],[STRATEGY MANAGER]],tblParameters[#Headers],0))*tblDetails[[#This Row],[ACTUAL WORK]]","v":{"v":5850,"d":"$5,850"}},{"$f":"INDEX(tblParameters[],MATCH(tblDetails[[#This Row],[PROJECT TYPE]],tblParameters[PROJECT TYPE],0),MATCH(tblDetails[[#Headers],[DESIGN SPECIALIST]],tblParameters[#Headers],0))*INDEX('PROJECT PARAMETERS'!$B$14:$H$14,1,MATCH(tblDetails[[#Headers],[DESIGN SPECIALIST]],tblParameters[#Headers],0))*tblDetails[[#This Row],[ACTUAL WORK]]","v":{"v":3900,"d":"$3,900"}},{"$f":"INDEX(tblParameters[],MATCH(tblDetails[[#This Row],[PROJECT TYPE]],tblParameters[PROJECT TYPE],0),MATCH(tblDetails[[#Headers],[EVENT STAFF]],tblParameters[#Headers],0))*INDEX('PROJECT PARAMETERS'!$B$14:$H$14,1,MATCH(tblDetails[[#Headers],[EVENT STAFF]],tblParameters[#Headers],0))*tblDetails[[#This Row],[ACTUAL WORK]]","v":{"v":0,"d":"$0"}},{"$f":"INDEX(tblParameters[],MATCH(tblDetails[[#This Row],[PROJECT TYPE]],tblParameters[PROJECT TYPE],0),MATCH(tblDetails[[#Headers],[ADMIN STAFF]],tblParameters[#Headers],0))*INDEX('PROJECT PARAMETERS'!$B$14:$H$14,1,MATCH(tblDetails[[#Headers],[ADMIN STAFF]],tblParameters[#Headers],0))*tblDetails[[#This Row],[ACTUAL WORK]]","v":{"v":2340,"d":"$2,340"}}]
[null,"Alpine Ski House","Event design","2013-07-12","2013-09-19","2013-08-07","2013-10-10",500,500,{"$f":"DAYS360(tblDetails[[#This Row],[ESTIMATED START]],tblDetails[[#This Row],[ESTIMATED FINISH]],FALSE)","v":67},{"$f":"DAYS360(tblDetails[[#This Row],[ACTUAL START]],tblDetails[[#This Row],[ACTUAL FINISH]],FALSE)","v":63},{"$f":"INDEX(tblParameters[],MATCH(tblDetails[[#This Row],[PROJECT TYPE]],tblParameters[PROJECT TYPE],0),MATCH(tblDetails[[#Headers],[ACCOUNT MANAGER]],tblParameters[#Headers],0))*INDEX('PROJECT PARAMETERS'!$B$14:$H$14,1,MATCH(tblDetails[[#Headers],[ACCOUNT MANAGER]],tblParameters[#Headers],0))*tblDetails[[#This Row],[ESTIMATED WORK]]","v":{"v":18000,"d":"$18,000"}},{"$f":"INDEX(tblParameters[],MATCH(tblDetails[[#This Row],[PROJECT TYPE]],tblParameters[PROJECT TYPE],0),MATCH(tblDetails[[#Headers],[PROJECT MANAGER]],tblParameters[#Headers],0))*INDEX('PROJECT PARAMETERS'!$B$14:$H$14,1,MATCH(tblDetails[[#Headers],[PROJECT MANAGER]],tblParameters[#Headers],0))*tblDetails[[#This Row],[ESTIMATED WORK]]","v":{"v":12000,"d":"$12,000"}},{"$f":"INDEX(tblParameters[],MATCH(tblDetails[[#This Row],[PROJECT TYPE]],tblParameters[PROJECT TYPE],0),MATCH(tblDetails[[#Headers],[STRATEGY MANAGER]],tblParameters[#Headers],0))*INDEX('PROJECT PARAMETERS'!$B$14:$H$14,1,MATCH(tblDetails[[#Headers],[STRATEGY MANAGER]],tblParameters[#Headers],0))*tblDetails[[#This Row],[ESTIMATED WORK]]","v":{"v":0,"d":"$0"}},{"$f":"INDEX(tblParameters[],MATCH(tblDetails[[#This Row],[PROJECT TYPE]],tblParameters[PROJECT TYPE],0),MATCH(tblDetails[[#Headers],[DESIGN SPECIALIST]],tblParameters[#Headers],0))*INDEX('PROJECT PARAMETERS'!$B$14:$H$14,1,MATCH(tblDetails[[#Headers],[DESIGN SPECIALIST]],tblParameters[#Headers],0))*tblDetails[[#This Row],[ESTIMATED WORK]]","v":{"v":25000,"d":"$25,000"}},{"$f":"INDEX(tblParameters[],MATCH(tblDetails[[#This Row],[PROJECT TYPE]],tblParameters[PROJECT TYPE],0),MATCH(tblDetails[[#Headers],[EVENT STAFF]],tblParameters[#Headers],0))*INDEX('PROJECT PARAMETERS'!$B$14:$H$14,1,MATCH(tblDetails[[#Headers],[EVENT STAFF]],tblParameters[#Headers],0))*tblDetails[[#This Row],[ESTIMATED WORK]]","v":{"v":0,"d":"$0"}},{"$f":"INDEX(tblParameters[],MATCH(tblDetails[[#This Row],[PROJECT TYPE]],tblParameters[PROJECT TYPE],0),MATCH(tblDetails[[#Headers],[ADMIN STAFF]],tblParameters[#Headers],0))*INDEX('PROJECT PARAMETERS'!$B$14:$H$14,1,MATCH(tblDetails[[#Headers],[ADMIN STAFF]],tblParameters[#Headers],0))*tblDetails[[#This Row],[ESTIMATED WORK]]","v":{"v":3000,"d":"$3,000"}},{"$f":"INDEX(tblParameters[],MATCH(tblDetails[[#This Row],[PROJECT TYPE]],tblParameters[PROJECT TYPE],0),MATCH(tblDetails[[#Headers],[ACCOUNT MANAGER]],tblParameters[#Headers],0))*INDEX('PROJECT PARAMETERS'!$B$14:$H$14,1,MATCH(tblDetails[[#Headers],[ACCOUNT MANAGER]],tblParameters[#Headers],0))*tblDetails[[#This Row],[ACTUAL WORK]]","v":{"v":18000,"d":"$18,000"}},{"$f":"INDEX(tblParameters[],MATCH(tblDetails[[#This Row],[PROJECT TYPE]],tblParameters[PROJECT TYPE],0),MATCH(tblDetails[[#Headers],[PROJECT MANAGER]],tblParameters[#Headers],0))*INDEX('PROJECT PARAMETERS'!$B$14:$H$14,1,MATCH(tblDetails[[#Headers],[PROJECT MANAGER]],tblParameters[#Headers],0))*tblDetails[[#This Row],[ACTUAL WORK]]","v":{"v":12000,"d":"$12,000"}},{"$f":"INDEX(tblParameters[],MATCH(tblDetails[[#This Row],[PROJECT TYPE]],tblParameters[PROJECT TYPE],0),MATCH(tblDetails[[#Headers],[STRATEGY MANAGER]],tblParameters[#Headers],0))*INDEX('PROJECT PARAMETERS'!$B$14:$H$14,1,MATCH(tblDetails[[#Headers],[STRATEGY MANAGER]],tblParameters[#Headers],0))*tblDetails[[#This Row],[ACTUAL WORK]]","v":{"v":0,"d":"$0"}},{"$f":"INDEX(tblParameters[],MATCH(tblDetails[[#This Row],[PROJECT TYPE]],tblParameters[PROJECT TYPE],0),MATCH(tblDetails[[#Headers],[DESIGN SPECIALIST]],tblParameters[#Headers],0))*INDEX('PROJECT PARAMETERS'!$B$14:$H$14,1,MATCH(tblDetails[[#Headers],[DESIGN SPECIALIST]],tblParameters[#Headers],0))*tblDetails[[#This Row],[ACTUAL WORK]]","v":{"v":25000,"d":"$25,000"}},{"$f":"INDEX(tblParameters[],MATCH(tblDetails[[#This Row],[PROJECT TYPE]],tblParameters[PROJECT TYPE],0),MATCH(tblDetails[[#Headers],[EVENT STAFF]],tblParameters[#Headers],0))*INDEX('PROJECT PARAMETERS'!$B$14:$H$14,1,MATCH(tblDetails[[#Headers],[EVENT STAFF]],tblParameters[#Headers],0))*tblDetails[[#This Row],[ACTUAL WORK]]","v":{"v":0,"d":"$0"}},{"$f":"INDEX(tblParameters[],MATCH(tblDetails[[#This Row],[PROJECT TYPE]],tblParameters[PROJECT TYPE],0),MATCH(tblDetails[[#Headers],[ADMIN STAFF]],tblParameters[#Headers],0))*INDEX('PROJECT PARAMETERS'!$B$14:$H$14,1,MATCH(tblDetails[[#Headers],[ADMIN STAFF]],tblParameters[#Headers],0))*tblDetails[[#This Row],[ACTUAL WORK]]","v":{"v":3000,"d":"$3,000"}}]
[null,"Baldwin Museum of Science","Event logistics","2013-07-30","2013-09-28","2013-09-14","2013-11-13",150,145,{"$f":"DAYS360(tblDetails[[#This Row],[ESTIMATED START]],tblDetails[[#This Row],[ESTIMATED FINISH]],FALSE)","v":58},{"$f":"DAYS360(tblDetails[[#This Row],[ACTUAL START]],tblDetails[[#This Row],[ACTUAL FINISH]],FALSE)","v":59},{"$f":"INDEX(tblParameters[],MATCH(tblDetails[[#This Row],[PROJECT TYPE]],tblParameters[PROJECT TYPE],0),MATCH(tblDetails[[#Headers],[ACCOUNT MANAGER]],tblParameters[#Headers],0))*INDEX('PROJECT PARAMETERS'!$B$14:$H$14,1,MATCH(tblDetails[[#Headers],[ACCOUNT MANAGER]],tblParameters[#Headers],0))*tblDetails[[#This Row],[ESTIMATED WORK]]","v":{"v":5400,"d":"$5,400"}},{"$f":"INDEX(tblParameters[],MATCH(tblDetails[[#This Row],[PROJECT TYPE]],tblParameters[PROJECT TYPE],0),MATCH(tblDetails[[#Headers],[PROJECT MANAGER]],tblParameters[#Headers],0))*INDEX('PROJECT PARAMETERS'!$B$14:$H$14,1,MATCH(tblDetails[[#Headers],[PROJECT MANAGER]],tblParameters[#Headers],0))*tblDetails[[#This Row],[ESTIMATED WORK]]","v":{"v":10800,"d":"$10,800"}},{"$f":"INDEX(tblParameters[],MATCH(tblDetails[[#This Row],[PROJECT TYPE]],tblParameters[PROJECT TYPE],0),MATCH(tblDetails[[#Headers],[STRATEGY MANAGER]],tblParameters[#Headers],0))*INDEX('PROJECT PARAMETERS'!$B$14:$H$14,1,MATCH(tblDetails[[#Headers],[STRATEGY MANAGER]],tblParameters[#Headers],0))*tblDetails[[#This Row],[ESTIMATED WORK]]","v":{"v":0,"d":"$0"}},{"$f":"INDEX(tblParameters[],MATCH(tblDetails[[#This Row],[PROJECT TYPE]],tblParameters[PROJECT TYPE],0),MATCH(tblDetails[[#Headers],[DESIGN SPECIALIST]],tblParameters[#Headers],0))*INDEX('PROJECT PARAMETERS'!$B$14:$H$14,1,MATCH(tblDetails[[#Headers],[DESIGN SPECIALIST]],tblParameters[#Headers],0))*tblDetails[[#This Row],[ESTIMATED WORK]]","v":{"v":0,"d":"$0"}},{"$f":"INDEX(tblParameters[],MATCH(tblDetails[[#This Row],[PROJECT TYPE]],tblParameters[PROJECT TYPE],0),MATCH(tblDetails[[#Headers],[EVENT STAFF]],tblParameters[#Headers],0))*INDEX('PROJECT PARAMETERS'!$B$14:$H$14,1,MATCH(tblDetails[[#Headers],[EVENT STAFF]],tblParameters[#Headers],0))*tblDetails[[#This Row],[ESTIMATED WORK]]","v":{"v":1200,"d":"$1,200"}},{"$f":"INDEX(tblParameters[],MATCH(tblDetails[[#This Row],[PROJECT TYPE]],tblParameters[PROJECT TYPE],0),MATCH(tblDetails[[#Headers],[ADMIN STAFF]],tblParameters[#Headers],0))*INDEX('PROJECT PARAMETERS'!$B$14:$H$14,1,MATCH(tblDetails[[#Headers],[ADMIN STAFF]],tblParameters[#Headers],0))*tblDetails[[#This Row],[ESTIMATED WORK]]","v":{"v":900,"d":"$900"}},{"$f":"INDEX(tblParameters[],MATCH(tblDetails[[#This Row],[PROJECT TYPE]],tblParameters[PROJECT TYPE],0),MATCH(tblDetails[[#Headers],[ACCOUNT MANAGER]],tblParameters[#Headers],0))*INDEX('PROJECT PARAMETERS'!$B$14:$H$14,1,MATCH(tblDetails[[#Headers],[ACCOUNT MANAGER]],tblParameters[#Headers],0))*tblDetails[[#This Row],[ACTUAL WORK]]","v":{"v":5220,"d":"$5,220"}},{"$f":"INDEX(tblParameters[],MATCH(tblDetails[[#This Row],[PROJECT TYPE]],tblParameters[PROJECT TYPE],0),MATCH(tblDetails[[#Headers],[PROJECT MANAGER]],tblParameters[#Headers],0))*INDEX('PROJECT PARAMETERS'!$B$14:$H$14,1,MATCH(tblDetails[[#Headers],[PROJECT MANAGER]],tblParameters[#Headers],0))*tblDetails[[#This Row],[ACTUAL WORK]]","v":{"v":10440,"d":"$10,440"}},{"$f":"INDEX(tblParameters[],MATCH(tblDetails[[#This Row],[PROJECT TYPE]],tblParameters[PROJECT TYPE],0),MATCH(tblDetails[[#Headers],[STRATEGY MANAGER]],tblParameters[#Headers],0))*INDEX('PROJECT PARAMETERS'!$B$14:$H$14,1,MATCH(tblDetails[[#Headers],[STRATEGY MANAGER]],tblParameters[#Headers],0))*tblDetails[[#This Row],[ACTUAL WORK]]","v":{"v":0,"d":"$0"}},{"$f":"INDEX(tblParameters[],MATCH(tblDetails[[#This Row],[PROJECT TYPE]],tblParameters[PROJECT TYPE],0),MATCH(tblDetails[[#Headers],[DESIGN SPECIALIST]],tblParameters[#Headers],0))*INDEX('PROJECT PARAMETERS'!$B$14:$H$14,1,MATCH(tblDetails[[#Headers],[DESIGN SPECIALIST]],tblParameters[#Headers],0))*tblDetails[[#This Row],[ACTUAL WORK]]","v":{"v":0,"d":"$0"}},{"$f":"INDEX(tblParameters[],MATCH(tblDetails[[#This Row],[PROJECT TYPE]],tblParameters[PROJECT TYPE],0),MATCH(tblDetails[[#Headers],[EVENT STAFF]],tblParameters[#Headers],0))*INDEX('PROJECT PARAMETERS'!$B$14:$H$14,1,MATCH(tblDetails[[#Headers],[EVENT STAFF]],tblParameters[#Headers],0))*tblDetails[[#This Row],[ACTUAL WORK]]","v":{"v":1160,"d":"$1,160"}},{"$f":"INDEX(tblParameters[],MATCH(tblDetails[[#This Row],[PROJECT TYPE]],tblParameters[PROJECT TYPE],0),MATCH(tblDetails[[#Headers],[ADMIN STAFF]],tblParameters[#Headers],0))*INDEX('PROJECT PARAMETERS'!$B$14:$H$14,1,MATCH(tblDetails[[#Headers],[ADMIN STAFF]],tblParameters[#Headers],0))*tblDetails[[#This Row],[ACTUAL WORK]]","v":{"v":870,"d":"$870"}}]
{"$rows_left_out":20}
{"sheet":"PROJECT TOTALS","index":2,"n_rows":29,"n_cols":14,"rows_kept":29}
[]
[null,{"$f":"'PROJECT PARAMETERS'!B2","v":"[Company Name]"}]
[null,"Event Management Project Tracker"]
[null,"Company Confidential"]
[]
[null,"PROJECT NAME","ACCOUNT MANAGER ESTIMATE","PROJECT MANAGER ESTIMATE","STRATEGY MANAGER ESTIMATE","DESIGN SPECIALIST ESTIMATE","EVENT STAFF ESTIMATE","ADMIN STAFF ESTIMATE","ACCOUNT MANAGER ACTUAL","PROJECT MANAGER ACTUAL","STRATEGY MANAGER ACTUAL","DESIGN SPECIALIST ACTUAL","EVENT STAFF ACTUAL","ADMIN STAFF ACTUAL"]
[null,"A. Datum Corporation",{"v":7200,"d":"$7,200.00"},{"v":2400,"d":"$2,400.00"},{"v":18000,"d":"$18,000.00"},{"v":0,"d":"$0.00"},{"v":0,"d":"$0.00"},{"v":1200,"d":"$1,200.00"},{"v":7920,"d":"$7,920.00"},{"v":2640,"d":"$2,640.00"},{"v":19800,"d":"$19,800.00"},{"v":0,"d":"$0.00"},{"v":0,"d":"$0.00"},{"v":1320,"d":"$1,320.00"}]
[null,"Adventure Works",{"v":14400,"d":"$14,400.00"},{"v":24000,"d":"$24,000.00"},{"v":6000,"d":"$6,000.00"},{"v":4000,"d":"$4,000.00"},{"v":0,"d":"$0.00"},{"v":2400,"d":"$2,400.00"},{"v":14040,"d":"$14,040.00"},{"v":23400,"d":"$23,400.00"},{"v":5850,"d":"$5,850.00"},{"v":3900,"d":"$3,900.00"},{"v":0,"d":"$0.00"},{"v":2340,"d":"$2,340.00"}]
[null,"Alpine Ski House",{"v":18000,"d":"$18,000.00"},{"v":12000,"d":"$12,000.00"},{"v":0,"d":"$0.00"},{"v":25000,"d":"$25,000.00"},{"v":0,"d":"$0.00"},{"v":3000,"d":"$3,000.00"},{"v":18000,"d":"$18,000.00"},{"v":12000,"d":"$12,000.00"},{"v":0,"d":"$0.00"},{"v":25000,"d":"$25,000.00"},{"v":0,"d":"$0.00"},{"v":3000,"d":"$3,000.00"}]
[null,"Baldwin Museum of Science",{"v":5400,"d":"$5,400.00"},{"v":10800,"d":"$10,800.00"},{"v":0,"d":"$0.00"},{"v":0,"d":"$0.00"},{"v":1200,"d":"$1,200.00"},{"v":900,"d":"$900.00"},{"v":5220,"d":"$5,220.00"},{"v":10440,"d":"$10,440.00"},{"v":0,"d":"$0.00"},{"v":0,"d":"$0.00"},{"v":1160,"d":"$1,160.00"},{"v":870,"d":"$870.00"}]
{"$rows_left_out":19}